{"text_format":"1","workbook":"xlsx","n_sheets":6,"sheets":["Instructions","Entrées","Données","Aperçu","Classement","Skalenwerte"],"not_rendered":{"charts":1,"images":1,"macros":1,"external_links":0,"defined_names":5,"comments":1,"pivot_tables":0},"unopened":[],"bounds":{"document_bytes":16777216,"sheet_cells":100000,"rows_first":2000,"rows_last":500,"rows_between":2000,"halvings":0,"cell_chars":16384,"cell_head_chars":4096},"cells_cut":0,"cells_raw":0,"read":"whole","date_system":"1900"}

{"sheet":"Instructions","index":0,"n_rows":33,"n_cols":9,"rows_kept":33,"cut":false,"hidden":false,"merged":[[0,0,2,11],[4,1,4,13],[32,12,32,13],[25,1,25,13],[30,1,30,13],[6,1,6,13],[12,1,12,13],[14,1,14,13],[15,3,15,13],[21,1,21,2],[22,1,22,2],[23,1,23,2],[21,3,21,13],[29,1,29,13],[22,3,22,13],[27,1,27,13],[7,1,7,13],[23,3,23,13],[10,1,10,13],[8,1,8,13]]}
["Instructions pour l'évaluation LEMOVIS-I\n(sports individuels)"]
[]
[]
[1,"Introduction"]
[null,"Pour contourner le problème de la désirabilité sociale dans l'auto-évaluation de la motivation pour la performance au moyen de questionnaires, il est recommandé d'utiliser le comportement observé par les entraîneurs (par exemple: à l'entraînement, en compétition, après une défaite, etc.) comme indicateur de motivation pour la performance.\nLEMOVIS-I permet de mesurer le comportement motivé par la performance des jeunes athlètes dans les sports individuels du point de vue de l'entraîneur. "]
[2,"Application"]
[null,"Dans le meilleur des cas, le questionnaire doit être rempli par deux entraîneurs (par ex. entraîneur principal et entraîneur adjoint) indépendamment l'un de l'autre, c'est-à-dire dans deux fichiers Excel séparés. Les évaluations peuvent être saisies directement dans la feuille Entrées de ce fichier; puis en cliquant sur le bouton Enregistrer l’évaluation et nouvelle entrée, les évaluations sont directement transférées dans la feuille Données. Tous les champs colorés doivent être remplis."]
[null,"Les procédures d'évaluation influencent les décisions de sélection et donc l'avenir sportif et personnel de chaque athlète. C’est la raison pour laquelle les entraîneurs doivent être extrêmement méticuleux."]
[null,"Lien vers le manuel de test \"LEMOVIS-I\""]
[3,"Aperçu des données"]
[null,"Dans la feuille Données, les colonnes G à P contiennent les évaluations de l’entraîneur 1.\nSi, comme recommandé, un deuxième entraîneur évalue le même athlète, les valeurs du fichier Excel de l'entraîneur 2 doivent être copiées dans les colonnes Q à AB."]
[4,"Résultats"]
[null,"Après la saisie complète des données, les résultats sont affichés sous forme de valeurs d'échelle dans les colonnes AC à AF de la feuille Données. Ces valeurs s’affichent également si un seul entraîneur a effectué l’évaluation."]
[5,"Interprétation des résultats"]
[null,"Pour une évaluation individuelle d'un athlète, le numéro d'identification personnel de l'athlète pour lequel les résultats doivent être affichés est à saisir dans le champ C5 de la feuille Aperçu."]
[null,"Valeurs d'échelle: ",null,"Les valeurs d'échelle sont les valeurs que les athlètes ont atteint dans l'échelle correspondante. Des valeurs élevées signifient une manifestation élevée de la caractéristique correspondante, des valeurs faibles signifient une manifestation faible. Selon l'échelle, différentes valeurs peuvent être obtenues:"]
[null,null,null,"Initiative personnelle (IP)",null,"0-4"]
[null,null,null,"Orientation vers la réussite (OR)",null,"0-4"]
[null,null,null,"Volonté de performance (VP)",null,"0-4"]
[null,null,null,"Score total (ST)",null,"0-12"]
[6,"Description des échelles"]
[null,"Initiative personnelle (IP)",null,"Les athlètes ayant un haut niveau d'initiative personnelle font preuve d'un haut niveau d'engagement à l'entraînement. Ils veulent s'entraîner davantage de leur propre initiative pour atteindre leurs objectifs. C'est pourquoi ils viennent souvent plus tôt à l’entraînement, restent plus longtemps ou veulent que l’entraîneur planifie des entraînements supplémentaires. Cette échelle a généralement la plus faible fréquence d’approbation des trois échelles de LEMOVIS-I."]
[null,"Orientation vers la réussite (OR)",null,"Les athlètes avec un haut niveau d'orientation vers la réussite aiment les compétitions et se fixent l'objectif de les gagner. S'ils ne réussissent pas, ils sont insatisfaits."]
[null,"Volonté de performance (VP)",null,"Les athlètes qui ont un haut niveau de volonté de performance élevé sont prêts et déterminés à fournir les performances à venir. Ils se comparent vers des athlètes plus forts et s'entraînent parfois jusqu'à l'épuisement. La plupart des athlètes ont les scores les plus élevés sur cette échelle."]
[7,"Sauvegarder comme PDF "]
[null,"Pour sauvegarder l’aperçu des résultats, un PDF peut être créé via le bouton Créer PDF. Celui-ci s’enregistre automatiquement dans le dossier où se trouve votre fichier Excel. Nom du PDF: PrénomDate.pdf (par ex. Joel20180920.pdf). Sur les ordinateurs Mac, vous devrez peut-être ajuster la zone d'impression et rechercher le document après sa création à l'aide de la fonction de recherche."]
[8,"Créer et analyser des classements"]
[null,"Pour analyser les données saisies dans les groupes, cliquez sur le bouton Transférer les données vers le classement (cela prend quelques secondes !) dans la feuille Classement, puis triez-les comme vous le souhaitez. Il est uniquement possible de transférer toutes les données ensemble. Si des analyses plus spécifiques doivent être effectuées, les ensembles de données sélectionnés doivent être copiés manuellement. "]
[9,"Informations complémentaires"]
[null,"Zuber, C. & Conzelmann, A. (2018). Comportement motivé par la performance dans les sports individuels – LEMOVIS-I. Manuel de test. Berne: Université de Berne, Bern Open Publishing."]
[null,"Zuber, C. & Conzelmann, A. (2017). Leistungsmotiviertes Verhalten im Sport: Konstruktion und Validierung eines Beobachtungsrasters. Abschlussbericht. Bern: Universität, Institut für Sportwissenschaft."]
[10,"Contact"]
[null,"Dr. Claudia Zuber, Institut für Sportwissenschaft, Universität Bern",null,null,null,null,null,null,"claudia.zuber@ispw.unibe.ch "]

{"sheet":"Entrées","index":1,"n_rows":26,"n_cols":14,"rows_kept":26,"cut":false,"hidden":false,"merged":[[23,9,23,13],[16,1,16,8],[17,1,17,8],[0,0,1,10],[6,6,6,7],[25,9,25,13],[14,9,14,13],[19,9,19,13],[20,9,20,13],[2,0,2,13],[8,0,8,13],[4,0,4,1],[24,9,24,13],[9,0,12,13],[16,9,16,13],[17,9,17,13],[18,9,18,13],[21,9,21,13],[22,9,22,13],[23,1,23,8],[24,1,24,8],[25,1,25,8],[6,0,6,2],[6,3,6,4],[18,1,18,8],[19,1,19,8],[20,1,20,8],[21,1,21,8],[22,1,22,8]]}
["Application de LEMOVIS-I \n(sports individuels)"]
[]
[" Données de l'athlète évalué/e "]
[]
["Athlète-No. ",null,null,"Prénom",null,"Nom",null,"Date de naissance"]
[]
["Nom entraîneur",null,null,null,null,null,"Date de l'évaluation",null,{"$f":"TODAY()","v":"2022-11-03"}]
[]
["Instructions"]
["Vous trouverez ci-dessous une liste de différents comportements. Veuillez s’il vous plaît estimer pour chaque athlète que vous souhaitez évaluer, à quelle fréquence il ou elle a présenté ces comportements au cours des 12 derniers mois ou depuis qu'il ou elle a travaillé avec vous. Il est important que vous choisissiez spontanément la réponse qui convient le mieux à l'athlète en question."]
[]
[]
[]
[]
["A quelle fréquence ",null,null,{"$f":"E5","v":0},"a-t-il/elle présenté les comportements suivants au cours des ",null,null,null,null,"Evaluation"]
["12 derniers mois ?",null,null,null,null,null,null,null,null,"0 =\nencore jamais","1 = rarement","2 = parfois","3 =\nsouvent","4 =\ntoujours"]
[1,"a demandé à l’entraîneur de planifier d'autres mesures d’entraînement afin de s'améliorer encore davantage"]
[2,"était énervé/e de ne pas avoir terminé la compétition à la première place."]
[3,"s’est comparé/e à des athlètes plus fort(e)s à l’entraînement."]
[4,"a été le/la premier/ère sur le terrain d’entraînement et a répété les gammes techniques de façon autonome. "]
[5,"a clairement annoncé avant la compétition qu'il/elle voulait gagner ce jour-là."]
[6,"s’est donné/e jusqu’à l’épuisement dans des exercices très épuisants. "]
[7,"est resté/e plus longtemps après l’entraînement pour continuer à s’exercer. "]
[8,"a montré qu'il/elle n'était pas satisfait/e de la 2ème place."]
[9,"a montré une posture corporelle \"active\" pendant l'entraînement."]
[10,"s'est occupé/e des possibilités de compenser les contenus d’entraînements manqués de manière autonome."]

{"sheet":"Données","index":2,"n_rows":200,"n_cols":32,"rows_kept":200,"cut":false,"hidden":false,"merged":[[0,0,0,3],[0,28,0,31],[1,4,1,5],[1,16,1,17],[0,6,0,15],[0,4,0,5],[0,16,0,17],[1,6,1,7],[1,8,1,9],[1,10,1,11],[1,12,1,13],[1,14,1,15],[0,18,0,27]]}
["Données de l'athlète",null,null,null,"Données de l'entraîneur 1",null,"Evaluation de l'entraîneur 1",null,null,null,null,null,null,null,null,null,"Données de l'entraîneur 2",null,"Evaluation de l'entraîneur 2",null,null,null,null,null,null,null,null,null,"Valeurs d'échelle"]
[null,null,null,null,null,null,"0 = encore jamais",null,"1= rarement",null,"2= parfois",null,"3= souvent",null,"4= toujours",null,null,null,"0 = encore jamais",null,"1= rarement",null,"2= parfois",null,"3= souvent",null,"4= toujours"]
["Athlète-No.","Prénom","Nom","Date de naissance","Nom de l'entraîneur","Date de l'évaluation 1",1,2,3,4,5,6,7,8,9,10,"Nom de l'entraîneur","Date de l'évaluation 2",1,2,3,4,5,6,7,8,9,10,"Score total (ST)","Initiative personnelle (IP)","Orientation vers la réussite (OR)","Volonté de performance (VP)"]
[null,"Marina","Licini","24.06.2022","Anna","03.11.2022",2,4,2,3,3,3,2,4,4,3,null,null,null,null,null,null,null,null,null,null,null,null,{"$f":"SUM(AD4:AF4)","v":9.1666666666666661},{"$f":"AVERAGE(G4,J4,M4,P4,S4,V4,Y4,AB4)","v":2.5},{"$f":"AVERAGE(H4,K4,N4,T4,W4,Z4)","v":3.6666666666666665},{"$f":"AVERAGE(I4,L4,O4,U4,X4,AA4)","v":3}]
[null,null,null,null,null,null,null,null,null,null,null,null,null,null,null,null,null,null,null,null,null,null,null,null,null,null,null,null,{"$error":"#DIV/0!"},{"$error":"#DIV/0!"},{"$error":"#DIV/0!"},{"$error":"#DIV/0!"}]
[null,null,null,null,null,null,null,null,null,null,null,null,null,null,null,null,null,null,null,null,null,null,null,null,null,null,null,null,{"$error":"#DIV/0!"},{"$error":"#DIV/0!"},{"$error":"#DIV/0!"},{"$error":"#DIV/0!"}]
[null,null,null,null,null,null,null,null,null,null,null,null,null,null,null,null,null,null,null,null,null,null,null,null,null,null,null,null,{"$error":"#DIV/0!"},{"$error":"#DIV/0!"},{"$error":"#DIV/0!"},{"$error":"#DIV/0!"}]
[null,null,null,null,null,null,null,null,null,null,null,null,null,null,null,null,null,null,null,null,null,null,null,null,null,null,null,null,{"$error":"#DIV/0!"},{"$error":"#DIV/0!"},{"$error":"#DIV/0!"},{"$error":"#DIV/0!"}]
[null,null,null,null,null,null,null,null,null,null,null,null,null,null,null,null,null,null,null,null,null,null,null,null,null,null,null,null,{"$error":"#DIV/0!"},{"$error":"#DIV/0!"},{"$error":"#DIV/0!"},{"$error":"#DIV/0!"}]
[null,null,null,null,null,null,null,null,null,null,null,null,null,null,null,null,null,null,null,null,null,null,null,null,null,null,null,null,{"$f":"SUM(AD10:AF10)","v":{"$error":"#DIV/0!"}},{"$error":"#DIV/0!"},{"$error":"#DIV/0!"},{"$error":"#DIV/0!"}]
[null,null,null,null,null,null,null,null,null,null,null,null,null,null,null,null,null,null,null,null,null,null,null,null,null,null,null,null,{"$f":"SUM(AD11:AF11)","v":{"$error":"#DIV/0!"}},{"$f":"AVERAGE(G11,J11,M11,P11,S11,V11,Y11,AB11)","v":{"$error":"#DIV/0!"}},{"$f":"AVERAGE(H11,K11,N11,T11,W11,Z11)","v":{"$error":"#DIV/0!"}},{"$f":"AVERAGE(I11,L11,O11,U11,X11,AA11)","v":{"$error":"#DIV/0!"}}]
[null,null,null,null,null,null,null,null,null,null,null,null,null,null,null,null,null,null,null,null,null,null,null,null,null,null,null,null,{"$error":"#DIV/0!"},{"$error":"#DIV/0!"},{"$error":"#DIV/0!"},{"$error":"#DIV/0!"}]
[null,null,null,null,null,null,null,null,null,null,null,null,null,null,null,null,null,null,null,null,null,null,null,null,null,null,null,null,{"$error":"#DIV/0!"},{"$error":"#DIV/0!"},{"$error":"#DIV/0!"},{"$error":"#DIV/0!"}]
[null,null,null,null,null,null,null,null,null,null,null,null,null,null,null,null,null,null,null,null,null,null,null,null,null,null,null,null,{"$error":"#DIV/0!"},{"$error":"#DIV/0!"},{"$error":"#DIV/0!"},{"$error":"#DIV/0!"}]
[null,null,null,null,null,null,null,null,null,null,null,null,null,null,null,null,null,null,null,null,null,null,null,null,null,null,null,null,{"$error":"#DIV/0!"},{"$error":"#DIV/0!"},{"$error":"#DIV/0!"},{"$error":"#DIV/0!"}]
[null,null,null,null,null,null,null,null,null,null,null,null,null,null,null,null,null,null,null,null,null,null,null,null,null,null,null,null,{"$error":"#DIV/0!"},{"$error":"#DIV/0!"},{"$error":"#DIV/0!"},{"$error":"#DIV/0!"}]
[null,null,null,null,null,null,null,null,null,null,null,null,null,null,null,null,null,null,null,null,null,null,null,null,null,null,null,null,{"$error":"#DIV/0!"},{"$error":"#DIV/0!"},{"$error":"#DIV/0!"},{"$error":"#DIV/0!"}]
[null,null,null,null,null,null,null,null,null,null,null,null,null,null,null,null,null,null,null,null,null,null,null,null,null,null,null,null,{"$error":"#DIV/0!"},{"$error":"#DIV/0!"},{"$error":"#DIV/0!"},{"$error":"#DIV/0!"}]
[null,null,null,null,null,null,null,null,null,null,null,null,null,null,null,null,null,null,null,null,null,null,null,null,null,null,null,null,{"$error":"#DIV/0!"},{"$error":"#DIV/0!"},{"$error":"#DIV/0!"},{"$error":"#DIV/0!"}]
[null,null,null,null,null,null,null,null,null,null,null,null,null,null,null,null,null,null,null,null,null,null,null,null,null,null,null,null,{"$error":"#DIV/0!"},{"$error":"#DIV/0!"},{"$error":"#DIV/0!"},{"$error":"#DIV/0!"}]
[null,null,null,null,null,null,null,null,null,null,null,null,null,null,null,null,null,null,null,null,null,null,null,null,null,null,null,null,{"$error":"#DIV/0!"},{"$error":"#DIV/0!"},{"$error":"#DIV/0!"},{"$error":"#DIV/0!"}]
[null,null,null,null,null,null,null,null,null,null,null,null,null,null,null,null,null,null,null,null,null,null,null,null,null,null,null,null,{"$error":"#DIV/0!"},{"$error":"#DIV/0!"},{"$error":"#DIV/0!"},{"$error":"#DIV/0!"}]
[null,null,null,null,null,null,null,null,null,null,null,null,null,null,null,null,null,null,null,null,null,null,null,null,null,null,null,null,{"$error":"#DIV/0!"},{"$error":"#DIV/0!"},{"$error":"#DIV/0!"},{"$error":"#DIV/0!"}]
[null,null,null,null,null,null,null,null,null,null,null,null,null,null,null,null,null,null,null,null,null,null,null,null,null,null,null,null,{"$error":"#DIV/0!"},{"$error":"#DIV/0!"},{"$error":"#DIV/0!"},{"$error":"#DIV/0!"}]
[null,null,null,null,null,null,null,null,null,null,null,null,null,null,null,null,null,null,null,null,null,null,null,null,null,null,null,null,{"$error":"#DIV/0!"},{"$error":"#DIV/0!"},{"$error":"#DIV/0!"},{"$error":"#DIV/0!"}]
[null,null,null,null,null,null,null,null,null,null,null,null,null,null,null,null,null,null,null,null,null,null,null,null,null,null,null,null,{"$error":"#DIV/0!"},{"$error":"#DIV/0!"},{"$error":"#DIV/0!"},{"$error":"#DIV/0!"}]
[null,null,null,null,null,null,null,null,null,null,null,null,null,null,null,null,null,null,null,null,null,null,null,null,null,null,null,null,{"$error":"#DIV/0!"},{"$error":"#DIV/0!"},{"$error":"#DIV/0!"},{"$error":"#DIV/0!"}]
[null,null,null,null,null,null,null,null,null,null,null,null,null,null,null,null,null,null,null,null,null,null,null,null,null,null,null,null,{"$error":"#DIV/0!"},{"$error":"#DIV/0!"},{"$error":"#DIV/0!"},{"$error":"#DIV/0!"}]
[null,null,null,null,null,null,null,null,null,null,null,null,null,null,null,null,null,null,null,null,null,null,null,null,null,null,null,null,{"$error":"#DIV/0!"},{"$error":"#DIV/0!"},{"$error":"#DIV/0!"},{"$error":"#DIV/0!"}]
[null,null,null,null,null,null,null,null,null,null,null,null,null,null,null,null,null,null,null,null,null,null,null,null,null,null,null,null,{"$error":"#DIV/0!"},{"$error":"#DIV/0!"},{"$error":"#DIV/0!"},{"$error":"#DIV/0!"}]
[null,null,null,null,null,null,null,null,null,null,null,null,null,null,null,null,null,null,null,null,null,null,null,null,null,null,null,null,{"$error":"#DIV/0!"},{"$error":"#DIV/0!"},{"$error":"#DIV/0!"},{"$error":"#DIV/0!"}]
[null,null,null,null,null,null,null,null,null,null,null,null,null,null,null,null,null,null,null,null,null,null,null,null,null,null,null,null,{"$error":"#DIV/0!"},{"$error":"#DIV/0!"},{"$error":"#DIV/0!"},{"$error":"#DIV/0!"}]
[null,null,null,null,null,null,null,null,null,null,null,null,null,null,null,null,null,null,null,null,null,null,null,null,null,null,null,null,{"$error":"#DIV/0!"},{"$error":"#DIV/0!"},{"$error":"#DIV/0!"},{"$error":"#DIV/0!"}]
[null,null,null,null,null,null,null,null,null,null,null,null,null,null,null,null,null,null,null,null,null,null,null,null,null,null,null,null,{"$error":"#DIV/0!"},{"$error":"#DIV/0!"},{"$error":"#DIV/0!"},{"$error":"#DIV/0!"}]
[null,null,null,null,null,null,null,null,null,null,null,null,null,null,null,null,null,null,null,null,null,null,null,null,null,null,null,null,{"$error":"#DIV/0!"},{"$error":"#DIV/0!"},{"$error":"#DIV/0!"},{"$error":"#DIV/0!"}]
[null,null,null,null,null,null,null,null,null,null,null,null,null,null,null,null,null,null,null,null,null,null,null,null,null,null,null,null,{"$error":"#DIV/0!"},{"$error":"#DIV/0!"},{"$error":"#DIV/0!"},{"$error":"#DIV/0!"}]
[null,null,null,null,null,null,null,null,null,null,null,null,null,null,null,null,null,null,null,null,null,null,null,null,null,null,null,null,{"$error":"#DIV/0!"},{"$error":"#DIV/0!"},{"$error":"#DIV/0!"},{"$error":"#DIV/0!"}]
[null,null,null,null,null,null,null,null,null,null,null,null,null,null,null,null,null,null,null,null,null,null,null,null,null,null,null,null,{"$error":"#DIV/0!"},{"$error":"#DIV/0!"},{"$error":"#DIV/0!"},{"$error":"#DIV/0!"}]
[null,null,null,null,null,null,null,null,null,null,null,null,null,null,null,null,null,null,null,null,null,null,null,null,null,null,null,null,{"$error":"#DIV/0!"},{"$error":"#DIV/0!"},{"$error":"#DIV/0!"},{"$error":"#DIV/0!"}]
[null,null,null,null,null,null,null,null,null,null,null,null,null,null,null,null,null,null,null,null,null,null,null,null,null,null,null,null,{"$error":"#DIV/0!"},{"$error":"#DIV/0!"},{"$error":"#DIV/0!"},{"$error":"#DIV/0!"}]
[null,null,null,null,null,null,null,null,null,null,null,null,null,null,null,null,null,null,null,null,null,null,null,null,null,null,null,null,{"$error":"#DIV/0!"},{"$error":"#DIV/0!"},{"$error":"#DIV/0!"},{"$error":"#DIV/0!"}]
[null,null,null,null,null,null,null,null,null,null,null,null,null,null,null,null,null,null,null,null,null,null,null,null,null,null,null,null,{"$error":"#DIV/0!"},{"$error":"#DIV/0!"},{"$error":"#DIV/0!"},{"$error":"#DIV/0!"}]
[null,null,null,null,null,null,null,null,null,null,null,null,null,null,null,null,null,null,null,null,null,null,null,null,null,null,null,null,{"$error":"#DIV/0!"},{"$error":"#DIV/0!"},{"$error":"#DIV/0!"},{"$error":"#DIV/0!"}]
[null,null,null,null,null,null,null,null,null,null,null,null,null,null,null,null,null,null,null,null,null,null,null,null,null,null,null,null,{"$error":"#DIV/0!"},{"$error":"#DIV/0!"},{"$error":"#DIV/0!"},{"$error":"#DIV/0!"}]
[null,null,null,null,null,null,null,null,null,null,null,null,null,null,null,null,null,null,null,null,null,null,null,null,null,null,null,null,{"$error":"#DIV/0!"},{"$error":"#DIV/0!"},{"$error":"#DIV/0!"},{"$error":"#DIV/0!"}]
[null,null,null,null,null,null,null,null,null,null,null,null,null,null,null,null,null,null,null,null,null,null,null,null,null,null,null,null,{"$error":"#DIV/0!"},{"$error":"#DIV/0!"},{"$error":"#DIV/0!"},{"$error":"#DIV/0!"}]
[null,null,null,null,null,null,null,null,null,null,null,null,null,null,null,null,null,null,null,null,null,null,null,null,null,null,null,null,{"$error":"#DIV/0!"},{"$error":"#DIV/0!"},{"$error":"#DIV/0!"},{"$error":"#DIV/0!"}]
[null,null,null,null,null,null,null,null,null,null,null,null,null,null,null,null,null,null,null,null,null,null,null,null,null,null,null,null,{"$error":"#DIV/0!"},{"$error":"#DIV/0!"},{"$error":"#DIV/0!"},{"$error":"#DIV/0!"}]
[null,null,null,null,null,null,null,null,null,null,null,null,null,null,null,null,null,null,null,null,null,null,null,null,null,null,null,null,{"$error":"#DIV/0!"},{"$error":"#DIV/0!"},{"$error":"#DIV/0!"},{"$error":"#DIV/0!"}]
[null,null,null,null,null,null,null,null,null,null,null,null,null,null,null,null,null,null,null,null,null,null,null,null,null,null,null,null,{"$error":"#DIV/0!"},{"$error":"#DIV/0!"},{"$error":"#DIV/0!"},{"$error":"#DIV/0!"}]
[null,null,null,null,null,null,null,null,null,null,null,null,null,null,null,null,null,null,null,null,null,null,null,null,null,null,null,null,{"$error":"#DIV/0!"},{"$error":"#DIV/0!"},{"$error":"#DIV/0!"},{"$error":"#DIV/0!"}]
[null,null,null,null,null,null,null,null,null,null,null,null,null,null,null,null,null,null,null,null,null,null,null,null,null,null,null,null,{"$error":"#DIV/0!"},{"$error":"#DIV/0!"},{"$error":"#DIV/0!"},{"$error":"#DIV/0!"}]
[null,null,null,null,null,null,null,null,null,null,null,null,null,null,null,null,null,null,null,null,null,null,null,null,null,null,null,null,{"$error":"#DIV/0!"},{"$error":"#DIV/0!"},{"$error":"#DIV/0!"},{"$error":"#DIV/0!"}]
[null,null,null,null,null,null,null,null,null,null,null,null,null,null,null,null,null,null,null,null,null,null,null,null,null,null,null,null,{"$error":"#DIV/0!"},{"$error":"#DIV/0!"},{"$error":"#DIV/0!"},{"$error":"#DIV/0!"}]
[null,null,null,null,null,null,null,null,null,null,null,null,null,null,null,null,null,null,null,null,null,null,null,null,null,null,null,null,{"$error":"#DIV/0!"},{"$error":"#DIV/0!"},{"$error":"#DIV/0!"},{"$error":"#DIV/0!"}]
[null,null,null,null,null,null,null,null,null,null,null,null,null,null,null,null,null,null,null,null,null,null,null,null,null,null,null,null,{"$error":"#DIV/0!"},{"$error":"#DIV/0!"},{"$error":"#DIV/0!"},{"$error":"#DIV/0!"}]
[null,null,null,null,null,null,null,null,null,null,null,null,null,null,null,null,null,null,null,null,null,null,null,null,null,null,null,null,{"$error":"#DIV/0!"},{"$error":"#DIV/0!"},{"$error":"#DIV/0!"},{"$error":"#DIV/0!"}]
[null,null,null,null,null,null,null,null,null,null,null,null,null,null,null,null,null,null,null,null,null,null,null,null,null,null,null,null,{"$error":"#DIV/0!"},{"$error":"#DIV/0!"},{"$error":"#DIV/0!"},{"$error":"#DIV/0!"}]
[null,null,null,null,null,null,null,null,null,null,null,null,null,null,null,null,null,null,null,null,null,null,null,null,null,null,null,null,{"$error":"#DIV/0!"},{"$error":"#DIV/0!"},{"$error":"#DIV/0!"},{"$error":"#DIV/0!"}]
[null,null,null,null,null,null,null,null,null,null,null,null,null,null,null,null,null,null,null,null,null,null,null,null,null,null,null,null,{"$error":"#DIV/0!"},{"$error":"#DIV/0!"},{"$error":"#DIV/0!"},{"$error":"#DIV/0!"}]
{"$rows_left_out":141}
{"sheet":"Aperçu","index":3,"n_rows":25,"n_cols":13,"rows_kept":25,"cut":false,"hidden":false,"merged":[[0,0,2,10],[24,3,24,4],[24,0,24,1],[3,0,3,12],[8,10,8,11],[9,10,9,11],[11,10,11,11],[10,10,10,11],[5,0,5,12],[6,7,6,8],[4,4,4,5],[8,1,8,4]]}
["Aperçu de l'évaluation LEMOVIS-I\n (sport individuels) "]
[]
[]
[" Données de l'athlète "]
[null,"No:",null,"Nom: ",{"$f":"VLOOKUP(C5,Données!A4:E200,2,)","v":{"$error":"#N/A"}},null,{"$f":"VLOOKUP(C5,Données!A4:F200,3,)","v":{"$error":"#N/A"}},"Date:",{"$f":"VLOOKUP(C5,Données!A4:F200,6,)","v":{"$error":"#N/A"}},"DN:",{"$f":"VLOOKUP(C5,Données!A4:F200,4,)","v":{"$error":"#N/A"}},"Âge:",{"$f":"DATEDIF(K5,I5,\"y\")","v":{"$error":"#N/A"}}]
["Evaluation de l'athlète"]
[]
[null,"Comportement motivé par la",null,null,null,null,null,null,null,null,"Echelle","Valeur","d'échelle"]
[null,"performance de",null,null,null,{"$f":"E5","v":{"$error":"#N/A"}},{"$f":"G5","v":{"$error":"#N/A"}},"le",{"$f":"I5","v":{"$error":"#N/A"}},null,"Initiative personnelle",null,{"$f":"VLOOKUP(C5,Données!A4:AF201,30,TRUE)","v":{"$error":"#N/A"}}]
[null,null,null,null,null,null,null,null,null,null,"Orientation vers\nla réussite",null,{"$f":"VLOOKUP(C5,Données!A4:AF201,31,TRUE)","v":{"$error":"#N/A"}}]
[null,null,null,null,null,null,null,null,null,null,"Volonté de\nperformance",null,{"$f":"VLOOKUP(C5,Données!A4:AF201,32,TRUE)","v":{"$error":"#N/A"}}]
[null,null,null,null,null,null,null,null,null,null,"Score total",null,{"$f":"VLOOKUP(C5,Données!A4:AF201,29,TRUE)","v":{"$error":"#N/A"}}]
[]
[]
[]
[]
[]
[]
[]
[]
[]
[]
[]
[]
["Date:",null,{"$f":"TODAY()","v":"2022-11-03"},"Evaluation de:",null,null,{"$f":"VLOOKUP(C5,Données!A4:F200,5,)","v":{"$error":"#N/A"}}]

{"sheet":"Classement","index":4,"n_rows":2,"n_cols":8,"rows_kept":2,"cut":false,"hidden":false,"merged":[[0,0,0,3],[0,4,0,7]]}
["Données de l'athlète",null,null,null,"Valeurs d'échelle"]
["Athlète-No.","Prénom","Nom","Date de naissance","Score total (ST)","Initiative personnelle (IP)","Orientation vers la réussite (OR)","Volonté de performance (VP)"]

{"sheet":"Skalenwerte","index":5,"n_rows":6,"n_cols":1,"rows_kept":6,"cut":false,"hidden":true,"merged":[]}
["Skalenwerte"]
[0]
[1]
[2]
[3]
[4]